﻿id	summary	reporter	owner	description	type	status	priority	milestone	component	version	resolution	keywords	cc	launchpad_bug
178	cygwin buildslave is screwed up ?	zooko	nobody	"The buildbot is red for cygwin.  I don't understand why.  First [http://allmydata.org/buildbot/builders/cygwin/builds/425 a test] failed due to:

{{{
[ERROR]: allmydata.test.test_client.Run.test_reloadable

Traceback (most recent call last):
  File ""/home/Buildslave/windows-cygwin-tahoe/windows-cygwin-tahoe/build/src/allmydata/test/test_client.py"", line 175, in _restart
}}}
...
{{{
  File ""/usr/lib/python2.5/site-packages/twisted/internet/tcp.py"", line 733, in startListening
    raise CannotListenError, (self.interface, self.port, le)
twisted.internet.error.CannotListenError: Couldn't listen on any:1919: (112, 'Address already in use').
}}}

and then [http://allmydata.org/buildbot/builders/cygwin/builds/427 a build] failed with:

{{{
python ./setup.py build_ext -i
Downloading file:misc/dependencies/setuptools-0.6c7-py2.5.egg
plink: unknown option ""-O""

wrote '0.6.0-75' into src/allmydata/_version.py
Downloading http://pypi.python.org/packages/2.5/s/setuptools/setuptools-0.6c7-py2.5.egg
md5 validation of setuptools-0.6c7-py2.5.egg failed!  (Possible download problem?)
Traceback (most recent call last):
  File ""./setup.py"", line 136, in <module>
    zip_safe=False, # We prefer unzipped for easier access.
  File ""/tmp/python.2408/usr/lib/python2.5/distutils/core.py"", line 112, in setup
  File ""/home/Buildslave/windows-cygwin-tahoe/windows-cygwin-tahoe/build/setuptools-0.6c7-py2.5.egg/setuptools/dist.py"", line 219, in __init__
  File ""/home/Buildslave/windows-cygwin-tahoe/windows-cygwin-tahoe/build/setuptools-0.6c7-py2.5.egg/setuptools/dist.py"", line 243, in fetch_build_eggs
  File ""/home/Buildslave/windows-cygwin-tahoe/windows-cygwin-tahoe/build/setuptools-0.6c7-py2.5.egg/pkg_resources.py"", line 522, in resolve
  File ""/home/Buildslave/windows-cygwin-tahoe/windows-cygwin-tahoe/build/setuptools-0.6c7-py2.5.egg/pkg_resources.py"", line 758, in best_match
  File ""/home/Buildslave/windows-cygwin-tahoe/windows-cygwin-tahoe/build/setuptools-0.6c7-py2.5.egg/pkg_resources.py"", line 770, in obtain
  File ""/home/Buildslave/windows-cygwin-tahoe/windows-cygwin-tahoe/build/setuptools-0.6c7-py2.5.egg/setuptools/dist.py"", line 286, in fetch_build_egg
  File ""/home/Buildslave/windows-cygwin-tahoe/windows-cygwin-tahoe/build/setuptools-0.6c7-py2.5.egg/setuptools/command/easy_install.py"", line 446, in easy_install
  File ""/home/Buildslave/windows-cygwin-tahoe/windows-cygwin-tahoe/build/setuptools-0.6c7-py2.5.egg/setuptools/command/easy_install.py"", line 471, in install_item
  File ""/home/Buildslave/windows-cygwin-tahoe/windows-cygwin-tahoe/build/setuptools-0.6c7-py2.5.egg/setuptools/command/easy_install.py"", line 655, in install_eggs
  File ""/home/Buildslave/windows-cygwin-tahoe/windows-cygwin-tahoe/build/setuptools-0.6c7-py2.5.egg/setuptools/command/easy_install.py"", line 930, in build_and_install
  File ""/home/Buildslave/windows-cygwin-tahoe/windows-cygwin-tahoe/build/setuptools-0.6c7-py2.5.egg/setuptools/command/easy_install.py"", line 921, in run_setup
distutils.errors.DistutilsError: Setup script exited with 2
make: *** [build] Error 1
program finished with exit code 2
}}}"	defect	closed	major	0.6.1	unknown	0.6.0	invalid			
